�s�撬���R�[�h,NO,�s���{����,�s�撬����,����,����_�J�i,����_�ʏ�,����_�p��,����������,���,�ꏊ����,�Z��,����,�ܓx,�o�x,�d�b�ԍ�,�����ԍ�,�����i���j,�����i�P�ʁj,�@�l�ԍ�,���L�ғ�,�������w���,���p�\�j��,�J�n����,�I������,���p�\�������L����,�摜,�摜_���C�Z���X,�T�v,�T�v_�p��,����,����_�p��,URL,���l
142166,400000,�_�ސ쌧,���Ԏs,�Ø\�O�N�I����,�J���N�T���l���L�{���V���E,,,���w��d�v������,���p�H�|�i,���J��,���Ԏs���J��3-12-22,,,,,,,,,���J��,1967/6/15,,,,,,,,,,,,�H��2222
142166,400001,�_�ސ쌧,���Ԏs,���J������,�V���E�R�N�W�����W��,,,�s�L�`������,���p�H�|�i,���J��,���Ԏs���J��3-12-22,,,,,,,,,���J��,1965/5/10,,,,,,,,,,,,�Õ�40-1
142166,400002,�_�ސ쌧,���Ԏs,��؉ƒb�蕶��,�X�Y�L�P�J�W�����W��,,,�s�L�`������,���p�H�|�i,,,,,,,,,,,�l��,1966/5/17,,,,,,,,,,,,�Õ�41-1
142166,400003,�_�ސ쌧,���Ԏs,���ƕ���,�I�I���P�����W��,,,�s�L�`������,���p�H�|�i,,,,,,,,,,,�l��,2004/10/8,,,,,,,,,,,,�Õ���16-1
142166,400004,�_�ސ쌧,���Ԏs,�ѓ��ƕ���,�C�C�W�}�P�����W��,,,�s�L�`������,���p�H�|�i,,,,,,,,,,,�l��,2004/10/8,,,,,,,,,,,,�Õ���16-2
142166,400005,�_�ސ쌧,���Ԏs,�ʌo�i�������D���q�d���j,�V���L���E�R���V�R���f�C�J���X�W�^�e,,,�s�L�`������,���p�H�|�i,�~����,���Ԏs���J��2-18-19,,,,,,,,,�~����,1968/3/27,,,,,,,,,,,,����42-1
142166,400006,�_�ސ쌧,���Ԏs,�I���w�Z�G�z,�N���n���K�b�R�E�w���K�N,,,�s�L�`������,���p�H�|�i,,,,,,046-255-1111,3554,,,,���Ԏs����ψ���,2011/3/31,,,,,,,,,,,,��22-1
142166,400007,�_�ސ쌧,���Ԏs,�u���B�Z�j�A�v���e��,�\�E�V���E�W���E�c�i�q�����C���L�U�V,,,�s�L�`������,���p�H�|�i,,,,,,,,,,,�l��,1967/5/11,,,,,,,,,,,,���H42-1
142166,400008,�_�ސ쌧,���Ԏs,�u���B�Z���A�v���e��,�\�E�V���E�W���E�`�J�q�����C���L�U�V,,,�s�L�`������,���p�H�|�i,,,,,,,,,,,�l��,2004/10/8,,,,,,,,,,,,���H��16-1
142166,400009,�_�ސ쌧,���Ԏs,�����X�؊|,�A�u�~�T�T�L�K�P,,,�s�L�`������,���p�H�|�i,�~����,���Ԏs���J��2-18-19,,,,,,,,,�~����,1969/6/24,,,,,,,,,,,,���H44-3
142166,400010,�_�ސ쌧,���Ԏs,�߉ޔ@������,�V���J�j�����C���c�]�E,,,�s�L�`������,���p�H�|�i,�S�⎛,���Ԏs���J��3-43-2,,,,,,,,,�S�⎛,1971/3/30,,,,,,,,,,,,����45-1
142166,400011,�_�ސ쌧,���Ԏs,���헲���{�ܗ֓�,�C���L�c�l�^�J�N���E�S�����g�E,,,�s�L�`������,������,�S�⎛,���Ԏs���J��3-43-2,,,,,,,,,�S�⎛,1967/5/11,,,,,,,,,,,,��42-1
142166,400012,�_�ސ쌧,���Ԏs,�Α�����@������,�Z�L�]�E�_�C�j�`�j�����C�U�]�E,,,�s�L�`������,������,,,,,,,,,,,�l��,1968/3/27,,,,,,,,,,,,��42-2
142166,400013,�_�ސ쌧,���Ԏs,�Z��������,���N�W�~���E�S�E�q,,,�s�L�`������,������,�@����,���Ԏs����1-3300,,,,,,,,,�@����,1969/6/24,,,,,,,,,,,,���H44-1
142166,400014,�_�ސ쌧,���Ԏs,��x����,�J�Q���E�h�E���E,,,�s�L�`������,������,�@����,���Ԏs����1-3300,,,,,,,,,�@����,1969/6/24,,,,,,,,,,,,���H44-2
142166,400015,�_�ސ쌧,���Ԏs,�_�ϑ��F��,�V���y���_�C�{�T�c�q,,,�s�L�`������,������,�z�K���_��,���Ԏs�V�c�h288,,,,,,,,,�z�K���_��,1974/1/17,,,,,,,,,,,,��48-1
142166,400016,�_�ސ쌧,���Ԏs,��⸈�,�z�E�L���E�C���g�E,,,�s�L�`������,������,���J��,���Ԏs���J��3-12-22,,,,,,,,,���J��,1978/12/23,,,,,,,,,,,,��53-1
142166,400017,�_�ސ쌧,���Ԏs,�ۓc�����q���{��,���X�_���X�x�G�N���E�g�E,,,�s�L�`������,������,��y��,���Ԏs�l�c�J489,,,,,,,,,��y��,2007/8/21,,,,,,,,,,,,��19-1
142166,400018,�_�ސ쌧,���Ԏs,�鎭�����Q,�X�Y�J�I�E�P�c�O��,,,�s�j�Ֆ����V�R�L�O��,,,,,,,,,,,,�l���L,1967/3/27,,,,,,,,,,,,�j41-1
142166,400019,�_�ސ쌧,���Ԏs,���̖؍≡���Q,�i�V�m�L�U�J�I�E�P�c�O��,,,�s�j�Ֆ����V�R�L�O��,,,,,,,046-255-1111,3554,,,,���Ԏs����ψ���,1974/1/17,,,,,,,,,,,,�j48-1
142166,400020,�_�ސ쌧,���Ԏs,�鎭���,�X�Y�J�C�Z�L,,,�s�j�Ֆ����V�R�L�O��,,�鎭���_��,���Ԏs���J��2-46-1,,,,,,,,,�鎭���_��,1982/1/25,,,,,,,,,,,,�j57-1
142166,400021,�_�ސ쌧,���Ԏs,���͖�����[�_,�T�K�~�m�L�Z���i���^���e��,,,�s�L�`������,������,,���Ԏs�Ђ΂肪�u1-5543,,,,,,,,,�l���L,2011/10/25,,,,,,,,,,,,�j23-1
142166,400022,�_�ސ쌧,���Ԏs,������ԓ_,�L�Z���`���E�J���e��,,,�s�L�`������,������,,���Ԏs���͂��u2-346-2,,,,046-255-1111,3554,,,,���Ԏs,2011/10/25,,,,,,,,,,,,�j23-2
142166,400023,�_�ސ쌧,���Ԏs,�炫�����U���,�T�L���P�`���c�o�L,,,�s�j�Ֆ����V�R�L�O��,,���J��,���Ԏs���J��3-12-22,,,,,,,,,���J��,1965/5/10,,,,,,,,,,,,�V40-1
142166,400024,�_�ސ쌧,���Ԏs,��O,�I�I�P���L,,,�s�j�Ֆ����V�R�L�O��,,�쉤�P��,���Ԏs���J��2-33,,,,,,,,,�쉤�Б�O�ۑ���,1967/5/11,,,,,,,,,,,,�V42-1
142166,400025,�_�ސ쌧,���Ԏs,�K���ʏ\������,�N���t�c�E�W���E�����W�V��,,,�s�j�Ֆ����V�R�L�O��,,,,,,,,,,,,�l���L,1969/6/24,,,,,,,,,,,,�V44-1
142166,400026,�_�ސ쌧,���Ԏs,���j,�j�b�P�C,,,�s�j�Ֆ����V�R�L�O��,,,,,,,,,,,,�l���L,1974/1/17,,,,,,,,,,,,�V48-1
142166,400027,�_�ސ쌧,���Ԏs,���~,�V���J�V,,,�s�j�Ֆ����V�R�L�O��,,�I���_��,���Ԏs�I������4-4-14,,,,,,,,,�I���_��,1978/12/23,,,,,,,,,,,,�V53-1
142166,400028,�_�ސ쌧,���Ԏs,��,�c�o�L,,,�s�j�Ֆ����V�R�L�O��,,,,,,,,,,,,�l���L,2012/11/19,,,,,,,,,,,,�V24-1
142166,400029,�_�ސ쌧,���Ԏs,�՚��q�w���܂���x�w�₽���x,�}�c���o���V�J�}�N�����^�C,,,�s����������,�|�\,,,,,,,,,,,�ቹ��,1968/3/27,,,,,,,,,,,,��42-1
142166,400030,�_�ސ쌧,���Ԏs,���ԉ̕���,�U�}�J�u�L,,,�s����������,�|�\,,,,,,,,,,,���J�̕����,1971/3/30,,,,,,,,,,,,��45-1
142166,400031,�_�ސ쌧,���Ԏs,�k�𓡋e�ۓ��D,�z�E�W���E�t�W�L�N�}�����i�t�_,,,�s�L�`������,���p�H�|�i,�鎭���_��,���Ԏs���J��2-46-1,,,,,,,,,�鎭���_��,2020/12/25,,,,,,,,,,,,�H��2-1